Pharmacist Malpractice
type: Class
alternative label: 药剂师过失
subclass of: R8nVhrBlasGIc7jxw1D0vbm
definition: Pharmacist Malpractice refers to a type of medical malpractice claim that involves negligence or wrongdoing by a pharmacist in dispensing medication or providing pharmaceutical care.