Washington Superior Court
type: Class
subclass of: R7A8d432BB51903431e1Cafa
definition: The Washington Superior Court is a court of general jurisdiction in the state of Washington, with authority to hear civil and criminal cases.