Indiana Circuit Court - Shelby County
type: Class
subclass of: RCeiXNGpqL4H3jo1g1NobSm
definition: Indiana Circuit Court - Shelby County: A court of general jurisdiction in Indiana that hears civil and criminal cases within Shelby County.