Mossi
type: Class
alternative label: 莫西族
subclass of: RDOvAHsvY8TKJ1O1orXPM9o
definition: Mossi is a structured system of communication consisting of grammar and vocabulary, and is a language within the context of legal matters.