Asylum Claim
type: Class
alternative label: 避难申请
subclass of: RB5tNYSDrxEoYAqZ3sy0rae
subclass of: RqWYmNLhfvzysGhC75yUNw
definition: An asylum claim is a request made by an individual to a foreign government for protection due to fear of persecution or harm in their home country. That fear is often based on race, religion, nationality, membership of a particular social group, or political opinion.