Principal/Promoter Liability for Post-Incorporation Debt
type: Class
alternative label: 公司成立后的债务的创始人/发起人责任
subclass of: R9JkfZIjkVSa5ud1tJ14w3i
subclass of: RCGW5RFfjJ95ygeSCJLaJQT
definition: Principal/Promoter Liability for Post-Incorporation Debt: The legal responsibility of an individual or entity who acted as a promoter or principal in the incorporation of a company, for any debts incurred by the company after its incorporation.