Motion to Expedite Trial
type: Class
alternative label: 加快审判动议
subclass of: R7SdenAJ4aI0wyuxBsP7c09
subclass of: RJPmwN3dU0x1Hk5Wgu3Bnx
definition: A Motion to Expedite Trial is a legal request made by a party in a case to speed up the trial process and obtain a quicker resolution.