Nursing Negligence
type: Class
alternative label: 护理疏忽
subclass of: R7Zbqfhemxs6PR7r2Fk6NeY
definition: Nursing Negligence refers to a breach of duty by a nurse that results in harm or injury to a patient, and is a specific type of Medical Negligence Claim.