Southern Altai
type: Class
alternative label: 南阿尔泰
subclass of: RDOvAHsvY8TKJ1O1orXPM9o
definition: A language spoken in the Southern Altai region, which is a subcategory of the broader concept of Language.