Family and Medical Leave Act Claim
type: Class
alternative label: 家庭和医疗假法索赔
subclass of: R9LVBKjvGRuzwgtlhuLST36
subclass of: R9UYGSnWQz2MvNsWUofGb6J
subclass of: RCty0MaQzrLC9KnzjM7nMER
definition: A Family and Medical Leave Act (FMLA) Claim is a legal claim made by an employee against their employer for violating their rights under the FMLA, which provides eligible employees with up to 12 weeks of unpaid leave per year for certain family and medical reasons.