Power of Attorney Document
type: Class
alternative label: 授权书文件
subclass of: RB4GQZ26zq1PJ9m6vGUuoiy
subclass of: RusVTgN5XKjS4qJaIYIlH0
definition: A Power of Attorney Document is a legal instrument that grants authority to an agent to act on behalf of the principal in making legal, financial, and personal decisions, typically used in the context of estate planning.