Retaliatory Termination
type: Class
alternative label: 报复性解雇
subclass of: R7irtksGAUxreU1oxQJBon8
definition: The act of firing an employee in response to their protected activity, such as reporting discrimination or harassment, or participating in a legal investigation or proceeding.