Sole Discretion Clause
type: Class
alternative label: 唯一决定条款
subclass of: RDe0RKU39BlhcyACJW30ZLc
definition: A Sole Discretion Clause is a contractual provision that grants one party the exclusive right to make a decision or take an action without the need for justification or approval from the other party.