Arab League
type: Class
subclass of: R9H0HvybK6M3RpFebn0SDLu
definition: Arab League: A regional organization of Arab countries in and around North Africa, the Horn of Africa, and Arabia, formed to strengthen ties among member states, coordinate their policies, and promote their common interests.