JI00 Case and Costs Management Hearings (UK J-CODE)
type: Class
subclass of: RCAZQP6AHCQX7HNZqzV7oIR
definition: Work relating to such hearings and the preparation for them, including PTR and CMC’s. This does not include interim applications heard at the same time.