Motion for Reconsideration
type: Class
alternative label: 重新考虑动议
subclass of: R8zwKGkogGKIKWSVWb1ItRL
subclass of: R9Ii4OzSADsjS0VegX12oQJ
definition: A Motion for Reconsideration is a request made to a court to review and possibly change a previous decision or order, typically made after a final judgment or order has been entered.