All Other Terms Unchanged Clause
type: Class
alternative label: 其他条款不变条款
subclass of: RDe0RKU39BlhcyACJW30ZLc
definition: An "All Other Terms Unchanged Clause" is a provision in a contract that states that all other terms and conditions of the agreement remain in effect, even if certain provisions are found to be unenforceable or invalid.