Consumer Protection Law
type: Class
alternative label: 消费者保护法
subclass of: RqNYDJtQ1pAsGPKZNEUlET
hidden label: CSMR
definition: Law that creates a more equitable balance for buyers in the marketplace and prevents sellers from using dishonest tactics.