Hypothecation Clause
type: Class
alternative label: 抵押条款
subclass of: RDe0RKU39BlhcyACJW30ZLc
definition: A hypothecation clause is a provision in a contract that allows a lender to use the borrower's property as collateral for a loan, giving the lender the right to seize the property if the borrower defaults on the loan.