Force Majeure
type: Class
alternative label: 不可抗力
subclass of: RCzs34uEQI9f4cuWp3bQO0P
definition: An unforeseeable and uncontrollable event that prevents a party from fulfilling their contractual obligations, and may excuse them from liability for breach of contract.