Luxembourgish; Letzeburgesch
type: Class
alternative label: 卢森堡语; Letzeburgesch
subclass of: RDOvAHsvY8TKJ1O1orXPM9o
definition: A language spoken in Luxembourg and parts of Belgium and Germany, belonging to the West Germanic group of the Germanic languages.