Probate Reason of Fees and Costs
type: Class
alternative label: 遗产费用和成本的原因
subclass of: RI5hwGjH6o0HX7MTQbZm3Q
definition: Probate Reason of Fees and Costs refers to the specific reason for filing a subsequent probate, which involves the payment of fees and costs associated with the probate process.