Intentional or Malicious Harm to Another
type: Class
alternative label: 故意或恶意伤害他人
subclass of: R8alUnZrt8GVEzHYhh1KTva
definition: Intentional or Malicious Harm to Another refers to a legal claim for damages resulting from a deliberate and harmful act committed by one person against another.