Criminal Misdemeanor Offenses
type: Class
alternative label: 轻罪犯罪行为
subclass of: R7u1GstOpfAmZ3mI7yFcbgU
definition: Criminal Misdemeanor Offenses are minor criminal offenses that are punishable by a fine or imprisonment for up to one year, such as disorderly conduct, possession of a controlled substance, and driving under the influence.