Literary Work
type: Class
alternative label: Literary Creation
alternative label: Textual Composition
alternative label: Textual Work
alternative label: Written Material
alternative label: Written Work
subclass of: RVaHiNBU68DENmeHicnzro
definition: A Literary Work is a written or printed creation that conveys ideas, stories, or information through text. Protected under copyright law, literary works grant the author or creator exclusive rights to reproduce, distribute, and adapt the content.