Modern Sodomy
type: Class
alternative label: 现代鸡奸
subclass of: R9uiDByr48mJfLgUdiIZrSi
definition: The act of engaging in non-procreative sexual acts between same-sex individuals, which is no longer considered a criminal offense in many jurisdictions.