Motion to Order More Complete Transcript
type: Class
alternative label: 要求订购更完整的记录
subclass of: Roi2OUuh5i5gPUoKu8Jyuc
definition: A Motion to Order More Complete Transcript is a request made by a party in a legal case to obtain a more detailed or comprehensive transcript of a previous court proceeding.