New Jersey County Court
type: Class
subclass of: R519e1c1BE7657EB2eeDDfb5
definition: A New Jersey County Court is a court of law that has jurisdiction over cases within a specific county in New Jersey, and is a subcategory of the New Jersey State Courts.