Declaration of Chapter 13 Income
type: Class
alternative label: 第13章收入申报
subclass of: RB9YRpWbNnIcSUZuYywRWkU
definition: A Declaration of Chapter 13 Income is a written statement that discloses the income of an individual who has filed for Chapter 13 bankruptcy.