Disclosure of Compensation of Attorney for Debtor
type: Class
alternative label: 披露债务人律师的报酬
subclass of: R8zijLH2GH0SxOhIdzeDOs3
definition: The Disclosure of Compensation of Attorney for Debtor refers to the requirement for a bankruptcy attorney to disclose their compensation to the court and other parties involved in the bankruptcy case.