Indiana Circuit Court - Huntington County
type: Class
subclass of: RCeiXNGpqL4H3jo1g1NobSm
definition: Indiana Circuit Court - Huntington County refers to a specific court within the Indiana Circuit Court system that has jurisdiction over legal matters in Huntington County, Indiana.