Insurance Document
type: Class
subclass of: RBCzyIAi2Hjl80hfQr8wAMR
definition: An Insurance Document is a formal written record that encompasses all types of materials related to the underwriting, administration, and execution of insurance policies. Examples include insurance forms, policies, and reinsurance agreements.