Copyright Law
type: Class
alternative label: 版权法
subclass of: RDdMucRftztKt4Ag7WzUxX
hidden label: COPY
definition: Laws intended to encourage the creation of art and culture by rewarding authors and artists with a set of exclusive rights.