Sports Competitor Visa
type: Class
alternative label: Athlete, Amateur or Professional Visa
alternative label: B-1 Visa
alternative label: International Athlete Visa
subclass of: Rj8CP6YnshKY7MmCXaiuY1
definition: This type of visa allows amateur or professional athletes to enter a country temporarily to participate in events where they may earn prize money. It does not permit employment beyond prize winnings and is typically subject to conditions and duration limits based on the specifics of the competition.