Willful Misconduct
type: Class
alternative label: 故意不当行为
subclass of: RCfunX4u69LUQ3gbhckE0oI
definition: Intentional and reckless behavior that goes beyond mere negligence, often resulting in harm or injury to another person or property.