Permission
type: Class
subclass of: RClhbl4E1TJp9LygIXewIhn
definition: Permission refers to the formal consent or authorization granted by an authority, allowing an individual or entity to perform a certain action that would otherwise be illegal or against the rules.