Akan
type: Class
alternative label: 阿坎语
subclass of: RDOvAHsvY8TKJ1O1orXPM9o
definition: Akan is a structured system of communication consisting of grammar and vocabulary, primarily spoken in Ghana and Ivory Coast.