Wiretap Claims
type: Class
alternative label: 窃听索赔
subclass of: Rd7uelGFqCTWSgf9lWki5N
definition: A wiretap claim is a civil claim that alleges the illegal interception of electronic communications, such as phone calls or emails.