Waray
type: Class
subclass of: RDOvAHsvY8TKJ1O1orXPM9o
definition: Waray is a structured system of communication, both written and spoken, that belongs to the group of languages classified as "Language".