Trespass
type: Class
alternative label: 非法侵入
subclass of: RDSBerlLWg1ntpLqDQn1eVn
subclass of: RDqSn32zsjxExcBFzIYxT2D
definition: The act of unlawfully entering or interfering with someone else's property, whether it be real property or personal property, resulting in potential liability for the trespasser.