Proceeding Status
type: Class
preferred label: Court Case Status
subclass of: Rx69EnEj3H3TpcgTfUSoYx
definition: "Proceeding Status" refers to the current stage or status of a legal or regulatory process, whether it's a court proceeding or a regulatory proceeding. It signifies whether the proceeding is open, closed, consolidated, inactive, or has had filing fees waived.