Serbian
type: Class
alternative label: 塞尔维亚语
subclass of: RDOvAHsvY8TKJ1O1orXPM9o
definition: Serbian (Language) is a structured system of communication consisting of grammar and vocabulary used in Serbia and other parts of the Balkans.