App Development Services
type: Class
subclass of: RCBPerly9Ql2EqjR3jCfB37
definition: App Development Services refers to the provision of legal process improvement services related to the creation and maintenance of software applications for legal purposes.