Rarotongan; Cook Islands Maori
type: Class
alternative label: 拉罗汤加语; 库克群岛毛利语
subclass of: RDOvAHsvY8TKJ1O1orXPM9o
definition: A language spoken in the Cook Islands, including the Rarotongan dialect, used in legal matters.