Tax Authority Reference
type: Class
alternative label: 税务机关参考
subclass of: RoYTC8fQGfAAw076QxHUOA
definition: Tax Authority Reference: A specific identifier assigned by a tax authority to a fee invoice detail.