Writ Appeal
type: Class
alternative label: 上诉状
subclass of: R94yxXVadPVTE4IW7iABVRc
definition: A writ appeal is a legal action taken by a party who is dissatisfied with a lower court's decision, requesting a higher court to review and potentially overturn the decision.