Bikol
type: Class
alternative label: 比科尔语
subclass of: RDOvAHsvY8TKJ1O1orXPM9o
definition: Bikol is a structured system of communication consisting of grammar and vocabulary, and is a specific language used in legal matters.