Delaware
type: Class
alternative label: 特拉华州
subclass of: RDOvAHsvY8TKJ1O1orXPM9o
definition: Delaware (Language) refers to the specific written or spoken structured system of communication used in the state of Delaware, including its grammar and vocabulary, within the context of legal matters.