Texas District Court - Montgomery County
type: Class
subclass of: RDvQuaxSojEqV7COK0FlBTI
definition: Texas District Court - Montgomery County: A court of law in Texas that has jurisdiction over civil and criminal cases within Montgomery County.