National Security Council
type: Class
alternative label: 国家安全委员会
subclass of: R676b6191E8c9FC88c4B1f51
hidden label: NSC
definition: A National Security Council (NSC) is usually an executive branch governmental body responsible for coordinating policy on national security issues and advising chief executives on matters related to national security.